Reaction Details
TargetMaternal embryonic leucine zipper kinase
LigandBDBM50043380
Substrate/Competitorn/a
Meas. Tech.ChEMBL_1444836 (CHEMBL3379606)
IC50 19±n/a nM
Citation Johnson, CNAdelinet, CBerdini, VBeke, LBonnet, PBrehmer, DCalo, FCoyle, JEDay, PJFrederickson, MFreyne, EJGilissen, RAHamlett, CCHoward, SMeerpoel, LMevellec, LMcMenamin, RPasquier, EPatel, SRees, DCLinders, JT Structure-Based Design of Type II Inhibitors Applied to Maternal Embryonic Leucine Zipper Kinase. ACS Med Chem Lett6:31-6 (2015) 
 
Maternal embryonic leucine zipper kinase
Name:Maternal embryonic leucine zipper kinase
Type:Enzyme
Mol. Mass.:74665.45
Organism:Homo sapiens (Human)
Description:Q14680
Residue:651
BDBM50043380
NameBDBM50043380
Synonyms:CHEMBL3355065
TypeSmall organic molecule
Emp. Form.C25H25F3N4O
Mol. Mass.454.4874
SMILESCNc1cc2ccc(cc2cn1)C#CCOc1ccc(CN2CCNCC2)c(c1)C(F)(F)F