Reaction Details
TargetProto-oncogene tyrosine-protein kinase receptor Ret
LigandBDBM50043380
Substrate/Competitorn/a
Meas. Tech.ChEMBL_1444842 (CHEMBL3379612)
IC50 10.0±n/a nM
Citation Johnson, CNAdelinet, CBerdini, VBeke, LBonnet, PBrehmer, DCalo, FCoyle, JEDay, PJFrederickson, MFreyne, EJGilissen, RAHamlett, CCHoward, SMeerpoel, LMevellec, LMcMenamin, RPasquier, EPatel, SRees, DCLinders, JT Structure-Based Design of Type II Inhibitors Applied to Maternal Embryonic Leucine Zipper Kinase. ACS Med Chem Lett6:31-6 (2015) 
 
Proto-oncogene tyrosine-protein kinase receptor Ret
Name:Proto-oncogene tyrosine-protein kinase receptor Ret
Type:Protein
Mol. Mass.:124318.29
Organism:Homo sapiens (Human)
Description:P07949
Residue:1114
BDBM50043380
NameBDBM50043380
Synonyms:CHEMBL3355065
TypeSmall organic molecule
Emp. Form.C25H25F3N4O
Mol. Mass.454.4874
SMILESCNc1cc2ccc(cc2cn1)C#CCOc1ccc(CN2CCNCC2)c(c1)C(F)(F)F