Reaction Details
TargetSerine/threonine-protein kinase Sgk1
LigandBDBM50043926
Substrate/Competitorn/a
Meas. Tech.ChEMBL_1445189 (CHEMBL3375441)
IC50 63±n/a nM
Citation Halland, NSchmidt, FWeiss, TSaas, JLi, ZCzech, JDreyer, MHofmeister, AMertsch, KDietz, UStrübing, CNazare, M Discovery of N-[4-(1H-Pyrazolo[3,4-b]pyrazin-6-yl)-phenyl]-sulfonamides as Highly Active and Selective SGK1 Inhibitors. ACS Med Chem Lett6:73-8 (2015) 
 
Serine/threonine-protein kinase Sgk1
Name:Serine/threonine-protein kinase Sgk1
Type:Other Protein Type
Mol. Mass.:48954.40
Organism:Homo sapiens (Human)
Description:Recombinant human SGK-1 enzyme produced in a baculovirus system.
Residue:431
BDBM50043926
NameBDBM50043926
Synonyms:CHEMBL3356021
TypeSmall organic molecule
Emp. Form.C17H12Cl2N4O2S2
Mol. Mass.439.339
SMILESNc1n[nH]c2cc(ccc12)-c1ccc(NS(=O)(=O)c2cc(Cl)sc2Cl)cc1