Reaction Details
TargetSerine/threonine-protein kinase Sgk1
LigandBDBM50043923
Substrate/Competitorn/a
Meas. Tech.ChEMBL_1445188 (CHEMBL3375440)
IC50 3.0±n/a nM
Citation Halland, NSchmidt, FWeiss, TSaas, JLi, ZCzech, JDreyer, MHofmeister, AMertsch, KDietz, UStrübing, CNazare, M Discovery of N-[4-(1H-Pyrazolo[3,4-b]pyrazin-6-yl)-phenyl]-sulfonamides as Highly Active and Selective SGK1 Inhibitors. ACS Med Chem Lett6:73-8 (2015) 
 
Serine/threonine-protein kinase Sgk1
Name:Serine/threonine-protein kinase Sgk1
Type:Other Protein Type
Mol. Mass.:48954.40
Organism:Homo sapiens (Human)
Description:Recombinant human SGK-1 enzyme produced in a baculovirus system.
Residue:431
BDBM50043923
NameBDBM50043923
Synonyms:CHEMBL3356018
TypeSmall organic molecule
Emp. Form.C17H13BrN4O2S2
Mol. Mass.449.345
SMILESNc1n[nH]c2cc(ccc12)-c1ccc(NS(=O)(=O)c2ccc(Br)s2)cc1