Reaction Details
TargetRibosomal protein S6 kinase alpha-3
LigandBDBM50044090
Substrate/Competitorn/a
Meas. Tech.ChEMBL_1445349 (CHEMBL3378501)
IC50 1230±n/a nM
Citation Li, MLi, YMrozowski, RMSandusky, ZMShan, MSong, XWu, BZhang, QLannigan, DAO'Doherty, GA Synthesis and Structure-Activity Relationship Study of 5a-Carbasugar Analogues of SL0101. ACS Med Chem Lett6:95-9 (2015) 
 
Ribosomal protein S6 kinase alpha-3
Name:Ribosomal protein S6 kinase alpha-3
Type:Serine/threonine-protein kinase
Mol. Mass.:83740.03
Organism:Homo sapiens (Human)
Description:The human RSK2 sequence differed from the Genbank entry NM_004586 at one residue, V45G. The protein was cloned and purified from baculovirus expression system.
Residue:740
BDBM50044090
NameBDBM50044090
Synonyms:CHEMBL3356437
TypeSmall organic molecule
Emp. Form.C24H24O10
Mol. Mass.472.4414
SMILESC[C@@H]1C[C@@H](Oc2c(oc3cc(O)cc(O)c3c2=O)-c2ccc(O)cc2)[C@H](O)[C@H](O)[C@H]1OC(C)=O