Reaction Details
TargetTransient receptor potential cation channel subfamily V member 1
LigandBDBM50133817
Substrate/Competitorn/a
Meas. Tech.ChEMBL_1452558 (CHEMBL3363425)
IC50 0.180000±n/a nM
Citation Terada, YKitajima, MTaguchi, FTakayama, HHorie, SWatanabe, T Identification of Indole Alkaloid Structural Units Important for Stimulus-Selective TRPM8 Inhibition: SAR Study of Naturally Occurring Iboga Derivatives. J Nat Prod77:1831-8 (2014) 
 
Transient receptor potential cation channel subfamily V member 1
Name:Transient receptor potential cation channel subfamily V member 1
Type:Protein
Mol. Mass.:94960.75
Organism:Homo sapiens (Human)
Description:Q8NER1
Residue:839
BDBM50133817
NameBDBM50133817
Synonyms:4-(3-Chloro-pyridin-2-yl)-piperazine-1-carboxylic acid (4-tert-butyl-phenyl)-amide CHEMBL441472 | N-(4-tert-butylphenyl)-4-(3-chloropyridin-2-yl)piperazine-1-carboxamide
TypeSmall organic molecule
Emp. Form.C20H25ClN4O
Mol. Mass.372.892
SMILESCC(C)(C)c1ccc(NC(=O)N2CCN(CC2)c2ncccc2Cl)cc1