Reaction Details
TargetCannabinoid receptor 1
LigandBDBM50147009
Substrate/Competitorn/a
Meas. Tech.ChEMBL_1454311 (CHEMBL3364151)
IC50 690±n/a nM
Citation Chorvat, RJ Peripherally restricted CB1 receptor blockers. Bioorg Med Chem Lett23:4751-60 (2013) 
 
Cannabinoid receptor 1
Name:Cannabinoid receptor 1
Type:G Protein-Coupled Receptor (GPCR)
Mol. Mass.:52856.55
Organism:Rattus norvegicus (rat)
Description:P20272
Residue:473
BDBM50147009
NameBDBM50147009
Synonyms:5-(4-Chloro-phenyl)-1-(2,4-dichloro-phenyl)-3-hexyl-1H-[1,2,4]triazole | CHEMBL328379
TypeSmall organic molecule
Emp. Form.C20H20Cl3N3
Mol. Mass.408.752
SMILESCCCCCCc1nc(-c2ccc(Cl)cc2)n(n1)-c1ccc(Cl)cc1Cl