Reaction Details
TargetCytochrome P450 11B2, mitochondrial
LigandBDBM50444549
Substrate/Competitorn/a
Meas. Tech.ChEMBL_1456067 (CHEMBL3366798)
IC50 0.200000±n/a nM
Citation Hu, QYin, LHartmann, RW Aldosterone synthase inhibitors as promising treatments for mineralocorticoid dependent cardiovascular and renal diseases. J Med Chem57:5011-22 (2014) 
 
Cytochrome P450 11B2, mitochondrial
Name:Cytochrome P450 11B2, mitochondrial
Type:Protein
Mol. Mass.:57582.15
Organism:Homo sapiens (Human)
Description:P19099
Residue:503
BDBM50444549
NameBDBM50444549
Synonyms:CHEMBL3099695
TypeSmall organic molecule
Emp. Form.C13H10FN3
Mol. Mass.227.237
SMILESFc1cc(ccc1[C@H]1CCc2cncn12)C#N