Reaction Details
TargetNucleotide-binding oligomerization domain-containing protein 2
LigandBDBM62261
Substrate/Competitorn/a
Meas. Tech.ChEMBL_1450779 (CHEMBL3363924)
IC50 260±n/a nM
Citation Jakopin, ? Nucleotide-binding oligomerization domain (NOD) inhibitors: a rational approach toward inhibition of NOD signaling pathway. J Med Chem57:6897-918 (2014) 
 
Nucleotide-binding oligomerization domain-containing protein 2
Name:Nucleotide-binding oligomerization domain-containing protein 2
Type:PROTEIN
Mol. Mass.:115287.18
Organism:Homo sapiens (Human)
Description:ChEMBL_1454053
Residue:1040
BDBM62261
NameBDBM62261
Synonyms:4-(3,4-dihydro-1H-isoquinolin-2-ylmethyl)-N-(4-methylsulfanylphenyl)benzamide MLS-0412148.0001 | cid_44182149
TypeSmall organic molecule
Emp. Form.C24H24N2OS
Mol. Mass.388.525
SMILESCSc1ccc(NC(=O)c2ccc(CN3CCc4ccccc4C3)cc2)cc1