Reaction Details
TargetPhosphatidylinositol 4,5-bisphosphate 3-kinase catalytic subunit alpha isoform
LigandBDBM50044284
Substrate/Competitorn/a
Meas. Tech.ChEMBL_1450783 (CHEMBL3363928)
Ki 16±n/a nM
Citation Collier, PNMartinez-Botella, GCornebise, MCottrell, KMDoran, JDGriffith, JPMahajan, SMaltais, FMoody, CSHuck, EPWang, TAronov, AM Structural basis for isoform selectivity in a class of benzothiazole inhibitors of phosphoinositide 3-kinase¿. J Med Chem58:517-21 (2015) 
 
Phosphatidylinositol 4,5-bisphosphate 3-kinase catalytic subunit alpha isoform
Name:Phosphatidylinositol 4,5-bisphosphate 3-kinase catalytic subunit alpha isoform
Type:Enzyme Subunit
Mol. Mass.:124294.87
Organism:Homo sapiens (Human)
Description:P42336
Residue:1068
BDBM50044284
NameBDBM50044284
Synonyms:CHEMBL3356892
TypeSmall organic molecule
Emp. Form.C16H16N4O2S
Mol. Mass.328.389
SMILESCOc1cncc(c1)-c1ccc2nc(NC(=O)N(C)C)sc2c1