Reaction Details
TargetPhosphatidylinositol 4,5-bisphosphate 3-kinase catalytic subunit gamma isoform
LigandBDBM50044278
Substrate/Competitorn/a
Meas. Tech.ChEMBL_1450782 (CHEMBL3363927)
Ki 7.0±n/a nM
Citation Collier, PNMartinez-Botella, GCornebise, MCottrell, KMDoran, JDGriffith, JPMahajan, SMaltais, FMoody, CSHuck, EPWang, TAronov, AM Structural basis for isoform selectivity in a class of benzothiazole inhibitors of phosphoinositide 3-kinase¿. J Med Chem58:517-21 (2015) 
 
Phosphatidylinositol 4,5-bisphosphate 3-kinase catalytic subunit gamma isoform
Name:Phosphatidylinositol 4,5-bisphosphate 3-kinase catalytic subunit gamma isoform
Type:Enzyme Subunit
Mol. Mass.:126470.30
Organism:Homo sapiens (Human)
Description:P48736
Residue:1102
BDBM50044278
NameBDBM50044278
Synonyms:CHEMBL3356898
TypeSmall organic molecule
Emp. Form.C20H20N6O2S
Mol. Mass.408.477
SMILESCOc1cncc(c1)-c1ccc2nc(NC(=O)NCCc3cn(C)cn3)sc2c1