Reaction Details
TargetPhosphatidylinositol 4,5-bisphosphate 3-kinase catalytic subunit gamma isoform
LigandBDBM50044282
Substrate/Competitorn/a
Meas. Tech.ChEMBL_1450782 (CHEMBL3363927)
Ki 190±n/a nM
Citation Collier, PNMartinez-Botella, GCornebise, MCottrell, KMDoran, JDGriffith, JPMahajan, SMaltais, FMoody, CSHuck, EPWang, TAronov, AM Structural basis for isoform selectivity in a class of benzothiazole inhibitors of phosphoinositide 3-kinase¿. J Med Chem58:517-21 (2015) 
 
Phosphatidylinositol 4,5-bisphosphate 3-kinase catalytic subunit gamma isoform
Name:Phosphatidylinositol 4,5-bisphosphate 3-kinase catalytic subunit gamma isoform
Type:Enzyme Subunit
Mol. Mass.:126470.30
Organism:Homo sapiens (Human)
Description:P48736
Residue:1102
BDBM50044282
NameBDBM50044282
Synonyms:CHEMBL3356894
TypeSmall organic molecule
Emp. Form.C19H23N5O2S
Mol. Mass.385.483
SMILESCOc1cncc(c1)-c1ccc2nc(NC(=O)NCCCN(C)C)sc2c1