Reaction Details
TargetAcetylcholinesterase
LigandBDBM50149201
Substrate/Competitorn/a
Meas. Tech.ChEMBL_1454326 (CHEMBL3364166)
Kd 0.000±n/a nM
Citation Abet, VMariani, ATruscott, FRBritton, SRodriguez, R Biased and unbiased strategies to identify biologically active small molecules. Bioorg Med Chem22:4474-89 (2014) 
 
Acetylcholinesterase
Name:Acetylcholinesterase
Type:Enzyme
Mol. Mass.:67792.70
Organism:Homo sapiens (Human)
Description:P22303
Residue:614
BDBM50149201
NameBDBM50149201
Synonyms:3,8-DIAMINO-6-PHENYL-5-[6-[1-[2-[(1,2,3,4-TETRAHYDRO-9-ACRIDINYL)AMINO]ETHYL]-1H-1,2,3-TRIAZOL-5-YL]HEXYL]-PHENANTHRIDINIUM CHEMBL117651
TypeSmall organic molecule
Emp. Form.C42H45N8
Mol. Mass.661.8598
SMILESNc1ccc2c(c1)c(-c1ccccc1)n(CCCCCCc1cnnn1CCNc1c3CCCCc3nc3ccccc13)c1cc(=[NH2+])ccc21