Reaction Details
TargetFarnesyl pyrophosphate synthase
LigandBDBM36500
Substrate/Competitorn/a
Meas. Tech.ChEMBL_1454339 (CHEMBL3364478)
IC50>500000000±n/a nM
Citation Abet, VMariani, ATruscott, FRBritton, SRodriguez, R Biased and unbiased strategies to identify biologically active small molecules. Bioorg Med Chem22:4474-89 (2014) 
 
Farnesyl pyrophosphate synthase
Name:Farnesyl pyrophosphate synthase
Type:Enzyme
Mol. Mass.:48272.89
Organism:Homo sapiens (Human)
Description:P14324
Residue:419
BDBM36500
NameBDBM36500
Synonyms:2-(5-Chlorobenzo[b]thiophen-3-yl)acetic acid, 1 | CID205058
TypeSmall organic molecule
Emp. Form.C10H7ClO2S
Mol. Mass.226.679
SMILESOC(=O)Cc1csc2ccc(Cl)cc12