Reaction Details
Target5-hydroxytryptamine receptor 6
LigandBDBM50163069
Substrate/Competitorn/a
Meas. Tech.ChEMBL_1459807 (CHEMBL3371193)
IC50 8.5±n/a nM
Citation Benhamú, BMartín-Fontecha, MVázquez-Villa, HPardo, LLópez-Rodríguez, ML Serotonin 5-HT6 receptor antagonists for the treatment of cognitive deficiency in Alzheimer's disease. J Med Chem57:7160-81 (2014) 
 
5-hydroxytryptamine receptor 6
Name:5-hydroxytryptamine receptor 6
Type:G Protein-Coupled Receptor (GPCR)
Mol. Mass.:46968.43
Organism:Homo sapiens (Human)
Description:P50406
Residue:440
BDBM50163069
NameBDBM50163069
Synonyms:1-Benzenesulfonyl-5-chloro-3-((R)-1-methyl-pyrrolidin-2-ylmethyl)-1H-indole | CHEMBL361213
TypeSmall organic molecule
Emp. Form.C20H21ClN2O2S
Mol. Mass.388.911
SMILESCN1CCC[C@@H]1Cc1cn(c2ccc(Cl)cc12)S(=O)(=O)c1ccccc1