Reaction Details
Target5-hydroxytryptamine receptor 6
LigandBDBM50044610
Substrate/Competitorn/a
Meas. Tech.ChEMBL_1459806 (CHEMBL3371192)
Ki 0.040000±n/a nM
Citation Benhamú, BMartín-Fontecha, MVázquez-Villa, HPardo, LLópez-Rodríguez, ML Serotonin 5-HT6 receptor antagonists for the treatment of cognitive deficiency in Alzheimer's disease. J Med Chem57:7160-81 (2014) 
 
5-hydroxytryptamine receptor 6
Name:5-hydroxytryptamine receptor 6
Type:G Protein-Coupled Receptor (GPCR)
Mol. Mass.:46968.43
Organism:Homo sapiens (Human)
Description:P50406
Residue:440
BDBM50044610
NameBDBM50044610
Synonyms:CHEMBL3329438
TypeSmall organic molecule
Emp. Form.C19H21Cl2N3O2S
Mol. Mass.426.36
SMILESClc1cccc(c1Cl)S(=O)(=O)N1CCc2c(C1)cccc2N1CCNCC1