Reaction Details
TargetHistone deacetylase 8
LigandBDBM50044645
Substrate/Competitorn/a
Meas. Tech.ChEMBL_1450059 (CHEMBL3373321)
IC50 55±n/a nM
Citation Tashima, TMurata, HKodama, H Design and synthesis of novel and highly-active pan-histone deacetylase (pan-HDAC) inhibitors. Bioorg Med Chem22:3720-31 (2014) 
 
Histone deacetylase 8
Name:Histone deacetylase 8
Type:Enzyme
Mol. Mass.:41749.60
Organism:Homo sapiens (Human)
Description:Q9BY41
Residue:377
BDBM50044645
NameBDBM50044645
Synonyms:CHEMBL3311473
TypeSmall organic molecule
Emp. Form.C19H27N3O4
Mol. Mass.361.4354
SMILESCC1(C)CC(=O)Nc2ccc(cc12)C(=O)NCCCCCCC(=O)NO