Reaction Details
TargetHistone deacetylase 8
LigandBDBM50044638
Substrate/Competitorn/a
Meas. Tech.ChEMBL_1450059 (CHEMBL3373321)
IC50 21±n/a nM
Citation Tashima, TMurata, HKodama, H Design and synthesis of novel and highly-active pan-histone deacetylase (pan-HDAC) inhibitors. Bioorg Med Chem22:3720-31 (2014) 
 
Histone deacetylase 8
Name:Histone deacetylase 8
Type:Enzyme
Mol. Mass.:41749.60
Organism:Homo sapiens (Human)
Description:Q9BY41
Residue:377
BDBM50044638
NameBDBM50044638
Synonyms:CHEMBL3309299
TypeSmall organic molecule
Emp. Form.C22H29N3O4
Mol. Mass.399.4834
SMILESCC1(C)CC(=O)Nc2ccc(cc12)C(=O)NC[C@H]1CC[C@H](CC1)\C=C\C(=O)NO