Reaction Details
TargetHistone deacetylase 4
LigandBDBM50044642
Substrate/Competitorn/a
Meas. Tech.ChEMBL_1450060 (CHEMBL3373901)
IC50 47±n/a nM
Citation Tashima, TMurata, HKodama, H Design and synthesis of novel and highly-active pan-histone deacetylase (pan-HDAC) inhibitors. Bioorg Med Chem22:3720-31 (2014) 
 
Histone deacetylase 4
Name:Histone deacetylase 4
Type:Enzyme
Mol. Mass.:119049.39
Organism:Homo sapiens (Human)
Description:P56524
Residue:1084
BDBM50044642
NameBDBM50044642
Synonyms:CHEMBL3311466
TypeSmall organic molecule
Emp. Form.C19H27N3O4
Mol. Mass.361.4354
SMILESCC1(C)CC(=O)Nc2ccc(NC(=O)CCCCCCC(=O)NO)cc12