Reaction Details
TargetHistone deacetylase 1
LigandBDBM50044641
Substrate/Competitorn/a
Meas. Tech.ChEMBL_1450056 (CHEMBL3373318)
IC50 14±n/a nM
Citation Tashima, TMurata, HKodama, H Design and synthesis of novel and highly-active pan-histone deacetylase (pan-HDAC) inhibitors. Bioorg Med Chem22:3720-31 (2014) 
 
Histone deacetylase 1
Name:Histone deacetylase 1
Type:Enzyme
Mol. Mass.:55090.27
Organism:Homo sapiens (Human)
Description:Q13547
Residue:482
BDBM50044641
NameBDBM50044641
Synonyms:CHEMBL3311465
TypeSmall organic molecule
Emp. Form.C17H23N3O4
Mol. Mass.333.3822
SMILESONC(=O)CCCCCCC(=O)Nc1ccc2NC(=O)CCc2c1