Reaction Details
TargetHistone deacetylase 1
LigandBDBM50044643
Substrate/Competitorn/a
Meas. Tech.ChEMBL_1450056 (CHEMBL3373318)
IC50 24±n/a nM
Citation Tashima, TMurata, HKodama, H Design and synthesis of novel and highly-active pan-histone deacetylase (pan-HDAC) inhibitors. Bioorg Med Chem22:3720-31 (2014) 
 
Histone deacetylase 1
Name:Histone deacetylase 1
Type:Enzyme
Mol. Mass.:55090.27
Organism:Homo sapiens (Human)
Description:Q13547
Residue:482
BDBM50044643
NameBDBM50044643
Synonyms:CHEMBL3311471
TypeSmall organic molecule
Emp. Form.C17H21N3O4
Mol. Mass.331.3663
SMILESONC(=O)CCCCCCNC(=O)c1ccc2[nH]c(=O)ccc2c1