Reaction Details
TargetTransient receptor potential cation channel subfamily A member 1
LigandBDBM50044832
Substrate/Competitorn/a
Meas. Tech.ChEMBL_1454389 (CHEMBL3364861)
IC50 290±n/a nM
Citation Laliberté, SVallée, FFournier, PABedard, LLabrecque, JAlbert, JS Discovery of a series of aryl-N-(3-(alkylamino)-5-(trifluoromethyl)phenyl)benzamides as TRPA1 antagonists. Bioorg Med Chem Lett24:3204-6 (2014) 
 
Transient receptor potential cation channel subfamily A member 1
Name:Transient receptor potential cation channel subfamily A member 1
Type:Protein
Mol. Mass.:127514.20
Organism:Homo sapiens (Human)
Description:O75762
Residue:1119
BDBM50044832
NameBDBM50044832
Synonyms:CHEMBL3311183
TypeSmall organic molecule
Emp. Form.C15H15F3N2OS
Mol. Mass.328.353
SMILESCC(C)Nc1cc(NC(=O)c2cccs2)cc(c1)C(F)(F)F