Reaction Details
TargetNeuronal acetylcholine receptor subunit alpha-7
LigandBDBM50161764
Substrate/Competitorn/a
Meas. Tech.ChEMBL_1454478 (CHEMBL3365593)
Ki 26±n/a nM
Citation Yu, LFZhang, HKCaldarone, BJEaton, JBLukas, RJKozikowski, AP Recent developments in novel antidepressants targetinga4ß2-nicotinic acetylcholine receptors. J Med Chem57:8204-23 (2014) 
 
Neuronal acetylcholine receptor subunit alpha-7
Name:Neuronal acetylcholine receptor subunit alpha-7
Type:n/a
Mol. Mass.:56448.33
Organism:Homo sapiens (Human)
Description: CHRNA7 (NACHRA7)
Residue:502
BDBM50161764
NameBDBM50161764
Synonyms:(R)-4-chloro-N-(quinuclidin-3-yl)benzamide CHEMBL177611 PNU-282987 | PNU282987
TypeSmall organic molecule
Emp. Form.C14H17ClN2O
Mol. Mass.264.751
SMILESClc1ccc(cc1)C(=O)N[C@H]1CN2CCC1CC2