Reaction Details
TargetNeuronal acetylcholine receptor subunit alpha-7
LigandBDBM50045045
Substrate/Competitorn/a
Meas. Tech.ChEMBL_1454452 (CHEMBL3365248)
Ki>300±n/a nM
Citation Yu, LFZhang, HKCaldarone, BJEaton, JBLukas, RJKozikowski, AP Recent developments in novel antidepressants targetinga4ß2-nicotinic acetylcholine receptors. J Med Chem57:8204-23 (2014) 
 
Neuronal acetylcholine receptor subunit alpha-7
Name:Neuronal acetylcholine receptor subunit alpha-7
Type:Enzyme
Mol. Mass.:56502.44
Organism:Rattus norvegicus (Rat)
Description:Q05941
Residue:502
BDBM50045045
NameBDBM50045045
Synonyms:CHEMBL3341965
TypeSmall organic molecule
Emp. Form.C12H12F3N
Mol. Mass.227.2256
SMILES[H][C@]12C[C@]([H])(CNC1)c1cc(ccc21)C(F)(F)F