Reaction Details
TargetPeptidyl-prolyl cis-trans isomerase FKBP1B
LigandBDBM36609
Substrate/Competitorn/a
Meas. Tech.ChEMBL_1458980 (CHEMBL3369573)
Kd 0.200000±n/a nM
Citation Gibbs, AC Elements and modulation of functional dynamics. J Med Chem57:7819-37 (2014) 
 
Peptidyl-prolyl cis-trans isomerase FKBP1B
Name:Peptidyl-prolyl cis-trans isomerase FKBP1B
Type:PROTEIN
Mol. Mass.:11785.40
Organism:Homo sapiens (Human)
Description:ChEMBL_1458980
Residue:108
BDBM36609
NameBDBM36609
Synonyms:Rapamycin C-7, analog 4 US11603377, Compound Ramycin
TypeSmall organic molecule
Emp. Form.C51H79NO13
Mol. Mass.914.1719
SMILESCO[C@@H]1C[C@H](C[C@@H](C)[C@@H]2CC(=O)[C@H](C)\C=C(C)\[C@@H](O)[C@@H](OC)C(=O)[C@H](C)C[C@H](C)\C=C\C=C\C=C(C)\[C@H](C[C@@H]3CC[C@@H](C)[C@@](O)(O3)C(=O)C(=O)N3CCCC[C@H]3C(=O)O2)OC)CC[C@H]1O