Reaction Details
Target5-hydroxytryptamine receptor 2B
LigandBDBM50045494
Substrate/Competitorn/a
Meas. Tech.ChEMBL_1447539 (CHEMBL3373146)
Ki 0.110000±n/a nM
Citation Moritomo, AYamada, HWatanabe, TItahana, HKoga, YAkuzawa, SOkada, M Synthesis and structure-activity relationships of new carbonyl guanidine derivatives as novel dual 5-HT2B and 5-HT7 receptor antagonists. Part 2. Bioorg Med Chem22:4323-37 (2014) 
 
5-hydroxytryptamine receptor 2B
Name:5-hydroxytryptamine receptor 2B
Type:G Protein-Coupled Receptor (GPCR)
Mol. Mass.:54312.47
Organism:Homo sapiens (Human)
Description:Receptor binding assays were performed using human clone stably expressed in CHO cells.
Residue:481
BDBM50045494
NameBDBM50045494
Synonyms:CHEMBL3310115
TypeSmall organic molecule
Emp. Form.C15H13Cl2N3O2
Mol. Mass.338.189
SMILESCl.[#7]\[#6](-[#7])=[#7]/[#6](=O)-c1ccc-2c(c1)-[#6](-[#8])-c1c-2cccc1Cl