Reaction Details
TargetMitogen-activated protein kinase 14
LigandBDBM19429
Substrate/Competitorn/a
Meas. Tech.ChEMBL_1457234 (CHEMBL3370278)
IC50 67±n/a nM
Citation Hasumi, KSato, SSaito, TKato, JYShirota, KSato, JSuzuki, HOhta, S Design and synthesis of 5-[(2-chloro-6-fluorophenyl)acetylamino]-3-(4-fluorophenyl)-4-(4-pyrimidinyl)isoxazole (AKP-001), a novel inhibitor of p38 MAP kinase with reduced side effects based on the antedrug concept. Bioorg Med Chem22:4162-76 (2014) 
 
Mitogen-activated protein kinase 14
Name:Mitogen-activated protein kinase 14
Type:Serine/threonine-protein kinase
Mol. Mass.:41286.76
Organism:Homo sapiens (Human)
Description:Q16539
Residue:360
BDBM19429
NameBDBM19429
Synonyms:4-[3-(4-fluorophenyl)-1H-pyrazol-4-yl]pyridine | SC-102
TypeSmall organic molecule
Emp. Form.C14H10FN3
Mol. Mass.239.2477
SMILESFc1ccc(cc1)-c1n[nH]cc1-c1ccncc1