Reaction Details
TargetMitogen-activated protein kinase 14
LigandBDBM50046053
Substrate/Competitorn/a
Meas. Tech.ChEMBL_1457234 (CHEMBL3370278)
IC50 2.7±n/a nM
Citation Hasumi, KSato, SSaito, TKato, JYShirota, KSato, JSuzuki, HOhta, S Design and synthesis of 5-[(2-chloro-6-fluorophenyl)acetylamino]-3-(4-fluorophenyl)-4-(4-pyrimidinyl)isoxazole (AKP-001), a novel inhibitor of p38 MAP kinase with reduced side effects based on the antedrug concept. Bioorg Med Chem22:4162-76 (2014) 
 
Mitogen-activated protein kinase 14
Name:Mitogen-activated protein kinase 14
Type:Serine/threonine-protein kinase
Mol. Mass.:41286.76
Organism:Homo sapiens (Human)
Description:Q16539
Residue:360
BDBM50046053
NameBDBM50046053
Synonyms:CHEMBL3310146
TypeSmall organic molecule
Emp. Form.C21H13ClF2N4O2
Mol. Mass.426.803
SMILESFc1ccc(-c2noc(NC(=O)Cc3ccccc3Cl)c2-c2ccncn2)c(F)c1