Reaction Details
TargetCarbonic anhydrase 12
LigandBDBM50046165
Substrate/Competitorn/a
Meas. Tech.ChEMBL_1447570 (CHEMBL3373765)
IC50 3302±n/a nM
Citation Rosatelli, ECarotti, ACeruso, MSupuran, CTGioiello, A Flow synthesis and biological activity of aryl sulfonamides as selective carbonic anhydrase IX and XII inhibitors. Bioorg Med Chem Lett24:3422-5 (2014) 
 
Carbonic anhydrase 12
Name:Carbonic anhydrase 12
Type:Enzyme
Mol. Mass.:39456.00
Organism:Homo sapiens (Human)
Description:Catalytic domain of human cloned isozyme was used in the assay
Residue:354
BDBM50046165
NameBDBM50046165
Synonyms:CHEMBL1621411
TypeSmall organic molecule
Emp. Form.C12H20N2O2S
Mol. Mass.256.364
SMILESCN(C)CCCNS(=O)(=O)c1ccc(C)cc1