Reaction Details
TargetCarbonic anhydrase 9
LigandBDBM50046169
Substrate/Competitorn/a
Meas. Tech.ChEMBL_1447569 (CHEMBL3373764)
IC50 74±n/a nM
Citation Rosatelli, ECarotti, ACeruso, MSupuran, CTGioiello, A Flow synthesis and biological activity of aryl sulfonamides as selective carbonic anhydrase IX and XII inhibitors. Bioorg Med Chem Lett24:3422-5 (2014) 
 
Carbonic anhydrase 9
Name:Carbonic anhydrase 9
Type:Enzyme
Mol. Mass.:49669.03
Organism:Homo sapiens (Human)
Description:Catalytic domain of human cloned isozyme was used in the assay
Residue:459
BDBM50046169
NameBDBM50046169
Synonyms:CHEMBL3310985
TypeSmall organic molecule
Emp. Form.C14H13NO3S
Mol. Mass.275.323
SMILESCC(=O)c1ccc(cc1)S(=O)(=O)Nc1ccccc1