Reaction Details
TargetCarbonic anhydrase 9
LigandBDBM50046167
Substrate/Competitorn/a
Meas. Tech.ChEMBL_1447569 (CHEMBL3373764)
IC50 76±n/a nM
Citation Rosatelli, ECarotti, ACeruso, MSupuran, CTGioiello, A Flow synthesis and biological activity of aryl sulfonamides as selective carbonic anhydrase IX and XII inhibitors. Bioorg Med Chem Lett24:3422-5 (2014) 
 
Carbonic anhydrase 9
Name:Carbonic anhydrase 9
Type:Enzyme
Mol. Mass.:49669.03
Organism:Homo sapiens (Human)
Description:Catalytic domain of human cloned isozyme was used in the assay
Residue:459
BDBM50046167
NameBDBM50046167
Synonyms:CHEMBL1332361
TypeSmall organic molecule
Emp. Form.C14H15NO2S
Mol. Mass.261.339
SMILESCc1ccc(cc1)S(=O)(=O)NCc1ccccc1