Reaction Details
TargetCarbonic anhydrase 9
LigandBDBM50428400
Substrate/Competitorn/a
Meas. Tech.ChEMBL_1447569 (CHEMBL3373764)
IC50 90±n/a nM
Citation Rosatelli, ECarotti, ACeruso, MSupuran, CTGioiello, A Flow synthesis and biological activity of aryl sulfonamides as selective carbonic anhydrase IX and XII inhibitors. Bioorg Med Chem Lett24:3422-5 (2014) 
 
Carbonic anhydrase 9
Name:Carbonic anhydrase 9
Type:Enzyme
Mol. Mass.:49669.03
Organism:Homo sapiens (Human)
Description:Catalytic domain of human cloned isozyme was used in the assay
Residue:459
BDBM50428400
NameBDBM50428400
Synonyms:CA inhibitor, 2 [(4-Methylphenyl)Sulfonyl]Phenylamine
TypeSmall organic molecule
Emp. Form.C13H13NO2S
Mol. Mass.247.313
SMILESCc1ccc(cc1)S(=O)(=O)Nc1ccccc1