Reaction Details
TargetCarbonic anhydrase 1
LigandBDBM50046167
Substrate/Competitorn/a
Meas. Tech.ChEMBL_1447565 (CHEMBL3373760)
IC50>50000±n/a nM
Citation Rosatelli, ECarotti, ACeruso, MSupuran, CTGioiello, A Flow synthesis and biological activity of aryl sulfonamides as selective carbonic anhydrase IX and XII inhibitors. Bioorg Med Chem Lett24:3422-5 (2014) 
 
Carbonic anhydrase 1
Name:Carbonic anhydrase 1
Type:Enzyme
Mol. Mass.:28873.37
Organism:Homo sapiens (Human)
Description:P00915
Residue:261
BDBM50046167
NameBDBM50046167
Synonyms:CHEMBL1332361
TypeSmall organic molecule
Emp. Form.C14H15NO2S
Mol. Mass.261.339
SMILESCc1ccc(cc1)S(=O)(=O)NCc1ccccc1