Reaction Details
TargetToxin ParE
LigandBDBM50047345
Substrate/Competitorn/a
Meas. Tech.ChEMBL_1454591 (CHEMBL3366703)
IC50 35±n/a nM
Citation Basarab, GSHill, PJGarner, CEHull, KGreen, OSherer, BADangel, PBManchester, JIBist, SHauck, SZhou, FUria-Nickelsen, MIllingworth, RAlm, RRooney, MEakin, AE Optimization of pyrrolamide topoisomerase II inhibitors toward identification of an antibacterial clinical candidate (AZD5099). J Med Chem57:6060-82 (2014) 
 
Toxin ParE
Name:Toxin ParE
Type:PROTEIN
Mol. Mass.:11720.14
Organism:Escherichia coli
Description:ChEMBL_109450
Residue:103
BDBM50047345
NameBDBM50047345
Synonyms:CHEMBL3314588
TypeSmall organic molecule
Emp. Form.C27H35Cl2N9O4S
Mol. Mass.652.596
SMILESCO[C@H]1CN(CC[C@H]1NC(=O)c1[nH]c(C)c(Cl)c1Cl)c1nc(c(s1)C(O)=O)-c1cncc(NCCN2CCN(C)CC2)n1