Reaction Details
TargetATP-binding cassette sub-family C member 2
LigandBDBM50358848
Substrate/Competitorn/a
Meas. Tech.ChEMBL_1455463 (CHEMBL3363895)
EC50 27000±n/a nM
Citation Basarab, GSHill, PJGarner, CEHull, KGreen, OSherer, BADangel, PBManchester, JIBist, SHauck, SZhou, FUria-Nickelsen, MIllingworth, RAlm, RRooney, MEakin, AE Optimization of pyrrolamide topoisomerase II inhibitors toward identification of an antibacterial clinical candidate (AZD5099). J Med Chem57:6060-82 (2014) 
 
ATP-binding cassette sub-family C member 2
Name:ATP-binding cassette sub-family C member 2
Type:PROTEIN
Mol. Mass.:173415.22
Organism:Rattus norvegicus
Description:ChEMBL_1455464
Residue:1541
BDBM50358848
NameBDBM50358848
Synonyms:CHEMBL1923433
TypeSmall organic molecule
Emp. Form.C15H16Cl2N4O3S
Mol. Mass.403.284
SMILESCc1[nH]c(C(=O)NC2CCN(CC2)c2ncc(s2)C(O)=O)c(Cl)c1Cl