Reaction Details
TargetCalcitonin gene-related peptide type 1 receptor
LigandBDBM50356282
Substrate/Competitorn/a
Meas. Tech.ChEMBL_1457286 (CHEMBL3370551)
Ki 10.0±n/a nM
Citation Bell, IM Calcitonin gene-related peptide receptor antagonists: new therapeutic agents for migraine. J Med Chem57:7838-58 (2014) 
 
Calcitonin gene-related peptide type 1 receptor
Name:Calcitonin gene-related peptide type 1 receptor
Type:PROTEIN
Mol. Mass.:53330.91
Organism:Rattus norvegicus
Description:ChEMBL_1457286
Residue:464
BDBM50356282
NameBDBM50356282
Synonyms:CHEMBL1910936
TypeSmall organic molecule
Emp. Form.C31H29F2N5O3
Mol. Mass.557.5905
SMILESFc1cc(F)cc(c1)[C@@H]1CNC2(CCCC2)C(=O)N1CC(=O)Nc1ccc2C[C@]3(Cc2c1)C(=O)Nc1ncccc31