Reaction Details
TargetCalcitonin gene-related peptide type 1 receptor
LigandBDBM50224431
Substrate/Competitorn/a
Meas. Tech.ChEMBL_1457295 (CHEMBL3370560)
Kd 1.9±n/a nM
Citation Bell, IM Calcitonin gene-related peptide receptor antagonists: new therapeutic agents for migraine. J Med Chem57:7838-58 (2014) 
 
Calcitonin gene-related peptide type 1 receptor
Name:Calcitonin gene-related peptide type 1 receptor
Type:Enzyme Catalytic Domain
Mol. Mass.:52980.45
Organism:Homo sapiens (Human)
Description:Q16602
Residue:461
BDBM50224431
NameBDBM50224431
Synonyms:CHEMBL236593 N-[(3R,6S)-6-(2,3-difluorophenyl)-2-oxo-1-(2,2,2-trifluoroethyl)azepan-3-yl]-4-(2-oxo-2,3-dihydro-1H-imidazo[4,5-b]pyridin-1-yl)piperidine-1-carboxamide | Telcagepant
TypeSmall organic molecule
Emp. Form.C26H27F5N6O3
Mol. Mass.566.523
SMILESFc1cccc([C@@H]2CC[C@@H](NC(=O)N3CCC(CC3)n3c4cccnc4[nH]c3=O)C(=O)N(CC(F)(F)F)C2)c1F