Reaction Details
TargetHistone deacetylase 1
LigandBDBM50047970
Substrate/Competitorn/a
Meas. Tech.ChEMBL_1452866 (CHEMBL3365883)
Temperature298.15±n/a K
IC50 1000±n/a nM
Commentsextracted
Citation Valente, STrisciuoglio, DDe Luca, TNebbioso, ALabella, DLenoci, ABigogno, CDondio, GMiceli, MBrosch, GDel Bufalo, DAltucci, LMai, A 1,3,4-Oxadiazole-containing histone deacetylase inhibitors: anticancer activities in cancer cells. J Med Chem57:6259-65 (2014) 
 
Histone deacetylase 1
Name:Histone deacetylase 1
Type:Enzyme
Mol. Mass.:55090.27
Organism:Homo sapiens (Human)
Description:Q13547
Residue:482
BDBM50047970
NameBDBM50047970
Synonyms:CHEMBL3314864
TypeSmall organic molecule
Emp. Form.C28H22N4O2
Mol. Mass.446.4999
SMILESNc1ccccc1NC(=O)\C=C\c1ccc(cc1)-c1nnc(Cc2cccc3ccccc23)o1