Reaction Details
TargetHistone deacetylase 1
LigandBDBM50047964
Substrate/Competitorn/a
Meas. Tech.ChEMBL_1452866 (CHEMBL3365883)
Temperature298.15±n/a K
IC50 200±n/a nM
Commentsextracted
Citation Valente, STrisciuoglio, DDe Luca, TNebbioso, ALabella, DLenoci, ABigogno, CDondio, GMiceli, MBrosch, GDel Bufalo, DAltucci, LMai, A 1,3,4-Oxadiazole-containing histone deacetylase inhibitors: anticancer activities in cancer cells. J Med Chem57:6259-65 (2014) 
 
Histone deacetylase 1
Name:Histone deacetylase 1
Type:Enzyme
Mol. Mass.:55090.27
Organism:Homo sapiens (Human)
Description:Q13547
Residue:482
BDBM50047964
NameBDBM50047964
Synonyms:CHEMBL3314869
TypeSmall organic molecule
Emp. Form.C27H22N4O2
Mol. Mass.434.4892
SMILESNc1ccccc1NC(=O)c1ccc(Cc2nnc(Cc3cccc4ccccc34)o2)cc1