Reaction Details
TargetHistone deacetylase 4
LigandBDBM50047972
Substrate/Competitorn/a
Meas. Tech.ChEMBL_1452867 (CHEMBL3365884)
Temperature298.15±n/a K
IC50>20000±n/a nM
Commentsextracted
Citation Valente, STrisciuoglio, DDe Luca, TNebbioso, ALabella, DLenoci, ABigogno, CDondio, GMiceli, MBrosch, GDel Bufalo, DAltucci, LMai, A 1,3,4-Oxadiazole-containing histone deacetylase inhibitors: anticancer activities in cancer cells. J Med Chem57:6259-65 (2014) 
 
Histone deacetylase 4
Name:Histone deacetylase 4
Type:Enzyme
Mol. Mass.:119049.39
Organism:Homo sapiens (Human)
Description:P56524
Residue:1084
BDBM50047972
NameBDBM50047972
Synonyms:CHEMBL3314866
TypeSmall organic molecule
Emp. Form.C26H21N5O2
Mol. Mass.435.4772
SMILESNc1ccccc1NC(=O)\C=C\c1ccc(cc1)-c1nnc(Cc2c[nH]c3ccccc23)o1