Reaction Details
TargetCannabinoid receptor 2
LigandBDBM50048065
Substrate/Competitorn/a
Meas. Tech.ChEMBL_1453721 (CHEMBL3364123)
Ki 9180±n/a nM
Citation Hajdu, ZNicolussi, SRau, MLorántfy, LForgo, PHohmann, JCsupor, DGertsch, J Identification of endocannabinoid system-modulating N-alkylamides from Heliopsis helianthoides var. scabra and Lepidium meyenii. J Nat Prod77:1663-9 (2014) 
 
Cannabinoid receptor 2
Name:Cannabinoid receptor 2
Type:G Protein-Coupled Receptor (GPCR)
Mol. Mass.:39690.94
Organism:Homo sapiens (Human)
Description:P34972
Residue:360
BDBM50048065
NameBDBM50048065
Synonyms:CHEMBL3314941
TypeSmall organic molecule
Emp. Form.C22H31NO
Mol. Mass.325.4876
SMILESCCC\C=C/C#C\C=C/C=C/CC\C=C\C=C\C(=O)NCC(C)C