Reaction Details
TargetCannabinoid receptor 1
LigandBDBM50438779
Substrate/Competitorn/a
Meas. Tech.ChEMBL_1453720 (CHEMBL3364122)
Ki 8880±n/a nM
Citation Hajdu, ZNicolussi, SRau, MLorántfy, LForgo, PHohmann, JCsupor, DGertsch, J Identification of endocannabinoid system-modulating N-alkylamides from Heliopsis helianthoides var. scabra and Lepidium meyenii. J Nat Prod77:1663-9 (2014) 
 
Cannabinoid receptor 1
Name:Cannabinoid receptor 1
Type:G Protein-Coupled Receptor (GPCR)
Mol. Mass.:52868.96
Organism:Homo sapiens (Human)
Description:P21554
Residue:472
BDBM50438779
NameBDBM50438779
Synonyms:CHEMBL2413161
TypeSmall organic molecule
Emp. Form.C25H37NO
Mol. Mass.367.5674
SMILESCC\C=C/C\C=C/C\C=C/CCCCCCCC(=O)NCc1ccccc1