Reaction Details
TargetMonoglyceride lipase
LigandBDBM50438783
Substrate/Competitorn/a
Meas. Tech.ChEMBL_1453719 (CHEMBL3364121)
IC50>100000±n/a nM
Citation Hajdu, ZNicolussi, SRau, MLorántfy, LForgo, PHohmann, JCsupor, DGertsch, J Identification of endocannabinoid system-modulating N-alkylamides from Heliopsis helianthoides var. scabra and Lepidium meyenii. J Nat Prod77:1663-9 (2014) 
 
Monoglyceride lipase
Name:Monoglyceride lipase
Type:Hydrolase
Mol. Mass.:33391.67
Organism:Mus musculus (mouse)
Description:Assays were using membranes of recombinant MAG Lipase transiently transfected in COS-7 cells.
Residue:303
BDBM50438783
NameBDBM50438783
Synonyms:CHEMBL2415106
TypeSmall organic molecule
Emp. Form.C25H39NO
Mol. Mass.369.5833
SMILESCCCCC\C=C/C\C=C/CCCCCCCC(=O)NCc1ccccc1