Reaction Details
TargetMonoglyceride lipase
LigandBDBM50438779
Substrate/Competitorn/a
Meas. Tech.ChEMBL_1453719 (CHEMBL3364121)
IC50>100000±n/a nM
Citation Hajdu, ZNicolussi, SRau, MLorántfy, LForgo, PHohmann, JCsupor, DGertsch, J Identification of endocannabinoid system-modulating N-alkylamides from Heliopsis helianthoides var. scabra and Lepidium meyenii. J Nat Prod77:1663-9 (2014) 
 
Monoglyceride lipase
Name:Monoglyceride lipase
Type:Hydrolase
Mol. Mass.:33391.67
Organism:Mus musculus (mouse)
Description:Assays were using membranes of recombinant MAG Lipase transiently transfected in COS-7 cells.
Residue:303
BDBM50438779
NameBDBM50438779
Synonyms:CHEMBL2413161
TypeSmall organic molecule
Emp. Form.C25H37NO
Mol. Mass.367.5674
SMILESCC\C=C/C\C=C/C\C=C/CCCCCCCC(=O)NCc1ccccc1