Reaction Details
TargetFatty-acid amide hydrolase 1
LigandBDBM50438782
Substrate/Competitorn/a
Meas. Tech.ChEMBL_1453717 (CHEMBL3364119)
IC50 19050±n/a nM
Citation Hajdu, ZNicolussi, SRau, MLorántfy, LForgo, PHohmann, JCsupor, DGertsch, J Identification of endocannabinoid system-modulating N-alkylamides from Heliopsis helianthoides var. scabra and Lepidium meyenii. J Nat Prod77:1663-9 (2014) 
 
Fatty-acid amide hydrolase 1
Name:Fatty-acid amide hydrolase 1
Type:Protein
Mol. Mass.:63071.19
Organism:Homo sapiens (Human)
Description:O00519
Residue:579
BDBM50438782
NameBDBM50438782
Synonyms:CHEMBL2413162
TypeSmall organic molecule
Emp. Form.C26H39NO2
Mol. Mass.397.5934
SMILESCC\C=C/C\C=C/C\C=C/CCCCCCCC(=O)NCc1cccc(OC)c1