Reaction Details
TargetPapain
LigandBDBM50048082
Substrate/Competitorn/a
Meas. Tech.ChEMBL_1453723 (CHEMBL3364438)
IC50 1580±n/a nM
Citation Wammes, AEHendriks, TGAmatdjais-Groenen, HIWijdeven, MAvan Hest, JCvan Delft, FLRitschel, TRutjes, FP Influence of azide incorporation on binding affinity by small papain inhibitors. Bioorg Med Chem22:5593-603 (2014) 
 
Papain
Name:Papain
Type:Enzyme
Mol. Mass.:38923.01
Organism:Carica papaya
Description:Papain was purchased from Sigma, Germany.
Residue:345
BDBM50048082
NameBDBM50048082
Synonyms:CHEMBL3357958
TypeSmall organic molecule
Emp. Form.C22H24N6O2
Mol. Mass.404.465
SMILESCC(C)C[C@H](NC(=O)c1ccc(cc1)-c1ccc(CN=[N+]=[N-])cc1)C(=O)NCC#N