Reaction Details
TargetPapain
LigandBDBM50048083
Substrate/Competitorn/a
Meas. Tech.ChEMBL_1453723 (CHEMBL3364438)
IC50 13900±n/a nM
Citation Wammes, AEHendriks, TGAmatdjais-Groenen, HIWijdeven, MAvan Hest, JCvan Delft, FLRitschel, TRutjes, FP Influence of azide incorporation on binding affinity by small papain inhibitors. Bioorg Med Chem22:5593-603 (2014) 
 
Papain
Name:Papain
Type:Enzyme
Mol. Mass.:38923.01
Organism:Carica papaya
Description:Papain was purchased from Sigma, Germany.
Residue:345
BDBM50048083
NameBDBM50048083
Synonyms:CHEMBL3357959
TypeSmall organic molecule
Emp. Form.C25H22N6O2
Mol. Mass.438.4812
SMILES[N-]=[N+]=NCc1ccc(cc1)-c1ccc(cc1)C(=O)N[C@@H](Cc1ccccc1)C(=O)NCC#N