Reaction Details
TargetGalectin-7
LigandBDBM50243888
Substrate/Competitorn/a
Meas. Tech.ChEMBL_1454624 (CHEMBL3361813)
Kd 4800000±n/a nM
Citation Rajput, VKLeffler, HNilsson, UJMukhopadhyay, B Synthesis and evaluation of iminocoumaryl and coumaryl derivatized glycosides as galectin antagonists. Bioorg Med Chem Lett24:3516-20 (2014) 
 
Galectin-7
Name:Galectin-7
Type:Galactoside-binding protein
Mol. Mass.:15077.89
Organism:Homo sapiens (Human)
Description:n/a
Residue:136
BDBM50243888
NameBDBM50243888
Synonyms:CHEMBL442951 methyl beta-D-galactoside
TypeSmall organic molecule
Emp. Form.C7H14O6
Mol. Mass.194.1825
SMILESCO[C@@H]1O[C@H](CO)[C@H](O)[C@H](O)[C@H]1O