Reaction Details
TargetGalectin-8
LigandBDBM50048097
Substrate/Competitorn/a
Meas. Tech.ChEMBL_1454625 (CHEMBL3361814)
Kd 270000±n/a nM
Citation Rajput, VKLeffler, HNilsson, UJMukhopadhyay, B Synthesis and evaluation of iminocoumaryl and coumaryl derivatized glycosides as galectin antagonists. Bioorg Med Chem Lett24:3516-20 (2014) 
 
Galectin-8
Name:Galectin-8
Type:PROTEIN
Mol. Mass.:35814.23
Organism:Homo sapiens (Human)
Description:ChEMBL_1454625
Residue:317
BDBM50048097
NameBDBM50048097
Synonyms:CHEMBL3311525
TypeSmall organic molecule
Emp. Form.C25H27NO10S
Mol. Mass.533.548
SMILESCO[C@H]1O[C@H](CO)[C@H](O)[C@H](OCc2cc3ccccc3o\c2=N/S(=O)(=O)c2ccccc2)[C@H]1OC(C)=O