Reaction Details
TargetGalectin-8
LigandBDBM50048098
Substrate/Competitorn/a
Meas. Tech.ChEMBL_1454625 (CHEMBL3361814)
Kd 180000±n/a nM
Citation Rajput, VKLeffler, HNilsson, UJMukhopadhyay, B Synthesis and evaluation of iminocoumaryl and coumaryl derivatized glycosides as galectin antagonists. Bioorg Med Chem Lett24:3516-20 (2014) 
 
Galectin-8
Name:Galectin-8
Type:PROTEIN
Mol. Mass.:35814.23
Organism:Homo sapiens (Human)
Description:ChEMBL_1454625
Residue:317
BDBM50048098
NameBDBM50048098
Synonyms:CHEMBL3311526
TypeSmall organic molecule
Emp. Form.C17H20O8
Mol. Mass.352.3359
SMILESCO[C@H]1O[C@H](CO)[C@H](O)[C@H](OCc2cc3ccccc3oc2=O)[C@H]1O